nationallitteratur
broader: kulturella alster
preferred label: kansalliskirjallisuus @fi
preferred label: national literature @en
source: Kielitoimiston sanakirja
comment: se osa kansan kirjallisuutta, jossa kansan ominaispiirteet selvimmin ilmenevät
in scheme: conceptscheme
type: Concept

kulturella alster
preferred label: cultural accomplishments @en
preferred label: kulttuuriset tuotokset @fi
type: Concept
narrower: nationallitteratur