vattenbalans
broader: balansräkning
scope note: Prosessia tai systeemiä koskeva tulevien, lähtevien ja varastoituvien vesimäärien esitys kirjanpidon kaltaisessa muodossa
in scheme: conceptscheme
preferred label: vesitase @fi
preferred label: water balance @en
type: Concept

balansräkning
preferred label: balance sheets @en
preferred label: taseet @fi
type: Concept
narrower: vattenbalans