kulutus ja käyttö
preferred label: konsumtion och användning @sv
preferred label: consumption and usage @en
type: Concept
narrower: sovitus (koettaminen)

sovitus (koettaminen)
alternative label: sovitus
comment: koettaa asustetta tms. sen (koon) sopivuuden, istuvuuden toteamiseksi
broader: kulutus ja käyttö
preferred label: fitting (clothes) @en
preferred label: provande @sv
source: Kielitoimiston sanakirja
type: Concept
in scheme: conceptscheme