katetrar
preferred label: catheters @en
preferred label: katetrit @fi
type: Concept
broader: vårdredskap

vårdredskap
preferred label: hoitovälineet @fi
preferred label: instruments for treatment @en
broader: redskap
scope note: Namn på vårdredskap kan användas som ämnesord.
scope note: Hoitovälineiden nimiä voi käyttää asiasanoina
type: Concept
in scheme: conceptscheme
narrower: katetrar

redskap
preferred label: välineet @fi
type: Concept
narrower: vårdredskap