käyttö käyttökohteen mukaan
type: Collection
member: vedenkäyttö

käyttö
preferred label: use @en
preferred label: användning @sv
type: Concept
narrower: vedenkäyttö

vedenkäyttö
in scheme: conceptscheme
type: Concept
preferred label: use of water @en
preferred label: vattenanvändning @sv
scope note: Tarkoittaa mm. vesien virkistyskäyttöä, kalastusta, uittoa, kalankasvatusta, vesihuoltoa ja maatalouden vedenkäyttöä
alternative label: vesienkäyttö
broader: käyttö