democracy
preferred label: demokratia @fi
preferred label: demokrati @sv
type: Concept
related: democracy deficit

democracy deficit
in scheme: conceptscheme
preferred label: demokratiunderskott @sv
preferred label: demokratiavaje @fi
type: Concept
broader: societal phenomena
comment: demokraattisen legitiimiyden riittämätön toteutuminen Euroopan unionissa ja unionin sekä sen toimielimieen etääntyminen kansalaisista monimutkaisen toimintarakenteensa vuoksi
related: democracy
source: Europa-sanasto

societal phenomena
preferred label: samhälleliga fenomen @sv
preferred label: yhteiskunnalliset ilmiöt @fi
type: Concept
narrower: democracy deficit