external properties
preferred label: yttre egenskaper @sv
preferred label: ulkoiset ominaisuudet @fi
type: Concept
narrower: intersubjectivity

intersubjectivity
in scheme: conceptscheme
preferred label: intersubjektiivisuus @fi
preferred label: intersubjektivitet @sv
related: subjectivity
broader: external properties
type: Concept
scope note: Tarkoittaa yksilöiden välistä, kaikille yhteistä tai samanlaista havaintoa, tietoa tms.

subjectivity
preferred label: subjektivitet (egenskaper) @sv
preferred label: subjektiivisuus @fi
type: Concept
related: intersubjectivity