asema (ilmiöt)
preferred label: ställning @sv
preferred label: status @en
type: Concept
narrower: siviilisääty

siviilisääty
preferred label: marital status @en
preferred label: civilstånd @sv
in scheme: conceptscheme
type: Concept
related: perhesuhteet
source: Kielitoimiston sanakirja
comment: henkilön asema siinä suhteessa, onko hän naimaton, avioliitossa, leski vai eronnut
broader: asema (ilmiöt)

perhesuhteet
preferred label: family relations @en
preferred label: familjeförhållanden @sv
type: Concept
related: siviilisääty