tvångsituation
preferred label: pakkotila @fi
preferred label: state of necessity @en
related: självhjälp
source: Kielitoimiston sanakirja
comment: tilanne jossa vaarasta selviäminen on mahdollista vain toisen etua t. oikeutta loukkaamalla
in scheme: conceptscheme
broader: samhälleliga fenomen
alternative label: nödsituation
type: Concept

självhjälp
preferred label: itseapu @fi
preferred label: self-help @en
type: Concept
related: tvångsituation

samhälleliga fenomen
preferred label: societal phenomena @en
preferred label: yhteiskunnalliset ilmiöt @fi
type: Concept
narrower: tvångsituation