Villa Rulludd
broader: buildings
comment: Alfred Kihlmanin vuonna 1873 rakennuttama huvila Espoon Suomenojalla
in scheme: conceptscheme
type: Concept

buildings
preferred label: rakennukset @fi
preferred label: byggnader @sv
type: Concept
narrower: Villa Rulludd