biorytmit
preferred label: biorhythms @en
preferred label: biorytmer @sv
type: Concept
narrower: vuorokausirytmi (elintoimintojen)

vuorokausirytmi (elintoimintojen)
broader: biorytmit
in scheme: conceptscheme
alternative label: sirkadiaaninen rytmi
alternative label: sirkadiaanirytmi
alternative label: vuorokausirytmi
scope note: Sanalla on kaksi merkitystä. 1) Ulkoisten tekijöiden (aamuherätys, työaikataulu) ohjaama, tarkalleen vuorokauden pituisia jaksoja käsittävä rytmi. 2) Niiden elintoimintojen sisäsyntyinen rytmi, joiden toistuvan jakson pituus on suunnilleen 24 tuntia
preferred label: cirkadiansk rytm @sv
preferred label: diurnal rhythm @en
comment: Niiden elintoimintojen sisäsyntyinen rytmi, joiden toistuvan jakson pituus on suunnilleen 24 tuntia
source: Lähde: Lääketieteen termit
type: Concept