vårdbalans
type: Concept
broader: jämvikt
source: laakari.fi
comment: hoidolla saavutettu tilan vakaus, esim. diabetesta sairastavan potilaan verensokerin pysyminen viitetasolla
in scheme: conceptscheme
preferred label: therapeutic control @en
preferred label: hoitotasapaino @fi

jämvikt
preferred label: equilibrium @en
preferred label: tasapaino @fi
type: Concept
narrower: vårdbalans