dysplasiat
preferred label: dysplasier @sv
type: Concept
narrower: diastrofinen dysplasia

diastrofinen dysplasia
comment: Diastrofia on yleisin lyhytkasvuisuusoireyhtymä eli synnynnäinen luuston kasvuhäirio, joka aiheuttaa lyhytkasvuisuuden sekä nivelten rakenteen ja toiminnan häirioitä.
broader: dysplasiat
broader: kasvuhäiriöt
in scheme: conceptscheme
preferred label: Diastrophic dysplasia @en
preferred label: diastrofisk dysplasi @sv
type: Concept
alternative label: DTD

kasvuhäiriöt
preferred label: growth disorders @en
preferred label: tillväxtrubbningar @sv
type: Concept
narrower: diastrofinen dysplasia