roll i förhållande till socioekonomisk grupptillhörighet
preferred label: role related to socio-economic group @en
preferred label: sosioekonomiseen ryhmään liittyvä rooli @fi
type: Concept
narrower: riddare

riddare
broader: roll i förhållande till socioekonomisk grupptillhörighet
preferred label: ritarit @fi
preferred label: knights @en
source: Kielitoimiston sanakirja
comment: aatelisen sotilassäädyn jäsen keskiajalla
in scheme: conceptscheme
type: Concept