menettelyt
preferred label: förfaranden @sv
preferred label: procedures @en
type: Concept
narrower: alistus (ratkaistavaksi)

alistus (ratkaistavaksi)
alternative label: alistusmenettely
alternative label: alistaminen
alternative label: alistus
type: Concept
broader: menettelyt
in scheme: conceptscheme
source: Kielitoimiston sanakirja
preferred label: reference @en
preferred label: underordning @sv
comment: toimittaa päätös jkn (tav. ylemmässä asemassa olevan) ratkaistavaksi