kansliråd (titlar)
broader: hederstitlar
scope note: In singular 'kanslianeuvos', in plural 'kanslianeuvokset'.
in scheme: conceptscheme
preferred label: kanslianeuvokset (honorary titles) @en
preferred label: kanslianeuvokset @fi
type: Concept

hederstitlar
preferred label: honorary titles @en
preferred label: arvonimet @fi
type: Concept
narrower: kansliråd (titlar)