national parks
preferred label: kansallispuistot @fi
preferred label: nationalparker @sv
type: Concept
narrower: Pallas-Yllästunturi National Park

Pallas-Yllästunturi National Park
in scheme: conceptscheme
related: Pallas-Ounastunturi National Park
scope note: Pallas-Ounastunturin kansallispuisto ja Ylläs-Aakenuksen suojelualue yhdistettiin vuonna 2005 Pallas-Yllästunturin kansallispuistoksi
preferred label: Pallas-Yllästunturin kansallispuisto @fi
preferred label: Pallas-Yllästunturi nationalpark @sv
type: Concept
broader: national parks

Pallas-Ounastunturi National Park
preferred label: Pallas-Ounastunturi nationalpark @sv
preferred label: Pallas-Ounastunturin kansallispuisto @fi
type: Concept
part of: Pallas-Yllästunturi National Park
related: Pallas-Yllästunturi National Park