certificates of honour
in scheme: conceptscheme
type: Concept
comment: kilpailu- tm. saavutuksesta annettava painettu tunnustus(taulu), diplomi
preferred label: diplom @sv
preferred label: kunniakirjat @fi
source: Kielitoimiston sanakirja
alternative label: certificates of honor
broader: cultural accomplishments

cultural accomplishments
preferred label: kulturella alster @sv
preferred label: kulttuuriset tuotokset @fi
type: Concept
narrower: certificates of honour