tables of contents
preferred label: innehållsförteckningar @sv
preferred label: sisällysluettelot @fi
type: Concept
in scheme: conceptscheme
source: Suomen kielen perussanakirja
broader: catalogues
comment: 1) sivuviittein varustettu luettelo kirjan tms. eri osista, luvuista jne.; 2) luettelo paketin, pakkauksen tms. sisällyksestä

catalogues
preferred label: förteckningar @sv
preferred label: luettelot @fi
type: Concept
narrower: tables of contents