koppling
comment: yhdistää eril. mekanismeja, sähköisiä piirejä tms. kokonaisuudeksi
source: Kielitoimiston sanakirja
preferred label: kytkentä @fi
preferred label: connection @en
type: Concept
in scheme: conceptscheme
broader: förvandling

förvandling
preferred label: alteration @en
preferred label: toisenlaiseksi muuttaminen @fi
type: Concept
narrower: koppling