Villa Mairea
broader: buildings
comment: Alvar Aallon ystävilleen Maire ja Harry Gullichsenille Suomen residenssiksi ja edustusasunnoksi suunnittelema talo Noormarkussa
in scheme: conceptscheme
type: Concept

buildings
preferred label: rakennukset @fi
preferred label: byggnader @sv
type: Concept
narrower: Villa Mairea