samhälleliga alster
preferred label: societal accomplishments @en
preferred label: yhteiskunnalliset tuotokset @fi
type: Concept
narrower: rättshandling

rättshandling
type: Concept
preferred label: oikeustoimi @fi
preferred label: legal act @en
source: Kielitoimiston sanakirja
broader: samhälleliga alster
in scheme: conceptscheme
comment: oikeustoimi on tahdonilmaisu, jolla perustetaan, muutetaan, siirretään tai kumotaan oikeuksia ja velvollisuuksia; Sopimus on kaksipuolinen oikeustoimi. Vastikkeeton oikeustoimi, esim. lahjoitus.