rang
preferred label: ranks @en
preferred label: arvoasteet @fi
type: Concept
narrower: militära grader

befordringar
preferred label: promotions @en
preferred label: ylennykset @fi
type: Concept
related: militära grader

militära grader
related: befordringar
preferred label: sotilasarvot @fi
preferred label: military ranks @en
scope note: Sotilasarvojen nimiä voi käyttää asiasanoina, esim. kersantit
scope note: Namn på militära grader kan användas som ämnesord, t.ex. sergeanter.
in scheme: conceptscheme
type: Concept
broader: rang