elintarvikkeet valmistustavan mukaan
type: Collection
member: uuselintarvikkeet

uuselintarvikkeet
preferred label: nya livsmedel @sv
preferred label: novel foods @en
broader: elintarvikkeet
narrower: muuntogeeniset elintarvikkeet
in scheme: conceptscheme
scope note: Uuselintarvikkeet jaetaan kahteen ryhmään. 1) Uuselintarvikkeet ovat elintarvikkeita, joiden valmistuksessa on käytetty geenitekniikkaa. 2) Uuselintarvikkeet ovat elintarvikkeita, joilla on uusi tai tarkoituksellisesti muunnettu kemiallinen rakenne tai joita ei ennen ole käytetty elintarvikkeina tai jotka on valmistettu uudella tavalla
type: Concept

elintarvikkeet
preferred label: livsmedel @sv
preferred label: foods @en
type: Concept
narrower: uuselintarvikkeet

muuntogeeniset elintarvikkeet
preferred label: genetically modified foods @en
preferred label: genmodifierade livsmedel @sv
type: Concept
broader: uuselintarvikkeet