vårdapparatur
preferred label: treatment equipment @en
preferred label: hoitolaitteet @fi
scope note: Namn på vårdappartur kan användas som ämnesord.
scope note: Hoitolaitteiden nimiä voi käyttää asiasanoina
type: Concept
broader: apparater
in scheme: conceptscheme
related: medicinalutrustning

medicinalutrustning
preferred label: medical devices @en
preferred label: lääkintälaitteet @fi
type: Concept
related: vårdapparatur

apparater
preferred label: devices @en
preferred label: laitteet @fi
type: Concept
narrower: vårdapparatur