koptiska
broader: egyptiska
scope note: Koptin kieli on egyptin kielen myöhäisin muoto, jota Egyptin kristityt käyttivät puhe- ja kirjakielenään 100-luvulla jKr.Koptin kieltä kirjoitetaan kreikkalaisin kirjaimin. Arabialaisten valloitettua Egyptin 640-641 koptin kieli alkoi puhekielenä väistyä arabian kielen tieltä, ja 900-luvulta lähtien koptin kieltä on käytetty lähes yksinomaan liturgisena kielenä
in scheme: conceptscheme
preferred label: koptin kieli @fi
preferred label: coptic language @en
type: Concept

egyptiska
preferred label: Egyptian language @en
preferred label: egyptin kieli @fi
type: Concept
narrower: koptiska