atomer
preferred label: atoms @en
preferred label: atomit @fi
type: Concept
narrower: nuklider

nuklider
preferred label: nuclides @en
preferred label: nuklidit @fi
type: Concept
comment: atomilaji, jonka ytimessä on tietty lukumäärä protoneja ja neutroneja ja tietty energiatila ja jonka keskimääräinen elinikä kyseisessä tilassa on mitattavissa
broader: atomer
source: Ydinvoimatekniikan sanasto
in scheme: conceptscheme