viljelymenetelmät
preferred label: odlingsmetoder @sv
preferred label: cultivation methods @en
type: Concept
narrower: päällekkäisviljely

päällekkäisviljely
alternative label: kaksoiskylvö
broader: viljelymenetelmät
preferred label: relay intercropping @en
preferred label: samodling @sv
source: Lähde: Kokemuksia päällekkäisviljelystä
in scheme: conceptscheme
scope note: Päällekkäisviljely (kaksoiskylvö) on sekaviljelytapa, jossa syysvilja kylvetään jo keväällä kasvamaan yhdessä yksivuotisen kevätkylvöisen kasvin (päällyskasvin) kanssa
type: Concept