förvärv
preferred label: reception (transfer of ownership) @en
preferred label: saanti (omistuksen siirtäminen) @fi
type: Concept
narrower: återvinning (juridik)

återvinning (juridik)
alternative label: återvinning -- juridik
source: Kielitoimiston sanakirja
type: Concept
broader: förvärv
comment: määräolosuhteiden ennalleen saattamisesta vars. konkurssin t. ulosoton yhteydessä; eräs muutoksenhakukeino
preferred label: takaisinsaanti @fi
preferred label: recovery, legal proceedings @en
in scheme: conceptscheme