suomalais-ugrilaiset
preferred label: Finno-Ugrians @en
preferred label: finsk-ugriska folk @sv
type: Concept
narrower: muromat

muromat
comment: nykyisen Vladimirin alueella asuneet suomalais-ugrilaista muroman kieltä puhuneet muromat sulautuivat slaaveihin jo keskiajalle tultaessa
preferred label: muromer @sv
preferred label: Muromian people @en
in scheme: conceptscheme
broader: suomalais-ugrilaiset
alternative label: muromalaiset
type: Concept