tekstijulkaisut
preferred label: textutgåvor @sv
preferred label: text publications @en
type: Concept
broader: julkaisut
source: Lähde: Suomen kielen perussanakirja
scope note: Tarkoittaa historiallisesti ja kielitieteellisesti arvokkaita tekstejä sisältäviä julkaisuja
in scheme: conceptscheme

julkaisut
preferred label: publikationer @sv
preferred label: publications @en
type: Concept
narrower: tekstijulkaisut