nenä
type: Concept
preferred label: näsan @sv
preferred label: nose @en
broader: hengityselimet
in scheme: conceptscheme
source: MOT Lääketiede 2.0a
comment: hengitysteiden alkuosa, joka jakaantuu ulkonenään, nenäonteloon ja nenän sivuonteloihin; hengitystiet: putkijärjestelmä jonka kautta ilma kulkee keuhkoihin (nenäontelo, nielu, kurkunpää, henkitorvi sekä keuhkoputket haaroineen); hengityselimet: elimet joiden avulla elimistö saa ilmasta happea ja luovuttaa hiilidioksidia (hengitystiet ja keuhkot), alemmat hengityselimet: kurkunpää, henkitorvi, keuhkoputket haaroineen ja keuhkot. ylemmät hengityselimet: nenäontelo ja nielu

hengityselimet
preferred label: respiratory organs @en
preferred label: andningsorganen @sv
type: Concept
narrower: nenä