chilli
broader: spices
comment: Chili on nimitys niille paprikoille (Capsicum), joiden kapsaisiinipitoisuus on niin suuri, että niitä voidaan hyödyntää mausteina eri ruoissa.
in scheme: conceptscheme
preferred label: chili @sv
type: Concept

spices
preferred label: kryddor @sv
preferred label: mausteet @fi
type: Concept
narrower: chilli