battles
preferred label: strider @sv
preferred label: taistelut @fi
type: Concept
narrower: Battles of Tali-Ihantala

continuation war
preferred label: jatkosota @fi
preferred label: fortsättningskriget @sv
type: Concept
related: Battles of Tali-Ihantala

Battles of Tali-Ihantala
broader: battles
scope note: Jatkosodan loppuvaiheessa kesä-heinäkuun vaihteessa 1944 Viipurin koillispuolella käydyt taistelut
related: continuation war
in scheme: conceptscheme
preferred label: slaget vid Tali-Ihantala @sv
preferred label: Talin-Ihantalan taistelut @fi
type: Concept