kvittning (juridik)
preferred label: kuittaus @fi
preferred label: receipting @en
type: Concept
broader: förvandling
alternative label: kvittning -- juridik
comment: 1) tunnustaa nimikirjoituksella tm. merkinnällä (maksu)suoritus saaduksi tai lähetys vastaanotetuksi, merkitä kuittaus; 2) antaa, käyttää tai tehdä jotakin korvaukseksi, vastikkeeksi, tms., korvata, selvittää, hyvittää
source: Suomen kielen perussanakirja
in scheme: conceptscheme

förvandling
preferred label: alteration @en
preferred label: toisenlaiseksi muuttaminen @fi
type: Concept
narrower: kvittning (juridik)