Bluetooth
broader: telekommunikationsnät
source: Lähde: Järvinen, P., IT-tietosanakirja
scope note: Bluetooth on lyhyen kantaman langaton verkko, joka sai alkunsa Ericssonin hankkeesta rakentaa matkapuhelimen ja korvakuulokkeen välille langaton tiedonsiirtoyhteys. Myöhemmin siitä alettiin kehittää yleispätevää suppean kantaman verkkoa, joka korvaisi perinteiset kaapelit ja toimisi esim. mikron ja kirjoittimen tai matkapuhelimen ja mikrotietokoneen välisessä tiedonsiirrossa
in scheme: conceptscheme
type: Concept

telekommunikationsnät
preferred label: communication networks @en
preferred label: tietoliikenneverkot @fi
type: Concept
narrower: Bluetooth