Natura 2000
broader: environmental programmes
in scheme: conceptscheme
scope note: Euroopan unionin luontodirektiivin mukainen luonnonsuojelukohteiden verkosto
scope note: Natura 2000 är benämningen på ett nätverk av skyddad natur inom EU @sv
type: Concept

environmental programmes
preferred label: miljöprogram @sv
preferred label: ympäristöohjelmat @fi
type: Concept
narrower: Natura 2000