Pariisin rauha
preferred label: peace of paris @en
preferred label: Parisfreden @sv
scope note: Tarkoittaa Pariisissa solmittuja rauhansopimuksia. 1) 1763 seitsenvuotisen sodan päättänyt rauha. 2) 1782 solmittu esirauha, jossa Iso-Britannia tunnusti Yhdysvaltain riippumattomuuden. 3) 1814 solmittu ns. 1. Pariisin rauha ja 1815 solmittu ns. 2. Pariisin rauha, jotka päättivät Napoleonin sodat. 4) 1856 Krimin sodan päättänyt rauha. 5) 1898 rauha Yhdysvaltojen ja Espanjan välillä. 6) 1919-1920 solmitut ns. Pariisin esikaupunkirauhat, jotka päättivät 1. maailmansodan. 7) 27.7.1946-10.2.1947 pidetty rauhankonferenssi, jossa 2. maailmansodan voittajavallat solmivat rauhan Bulgarian, Italian, Romanian, Suomen ja Unkarin kanssa
in scheme: conceptscheme
source: Lähde: Facta 2001
type: Concept
broader: rauhansopimukset
alternative label: Pariisin rauhansopimukset

rauhansopimukset
preferred label: peace treaties @en
preferred label: fredsfördrag @sv
type: Concept
narrower: Pariisin rauha