taloudelliset ilmiöt
preferred label: ekonomiska fenomen @sv
preferred label: economic phenomena @en
type: Concept
narrower: lainat (luovutettu esine)

lainat (luovutettu esine)
type: Concept
preferred label: loans (loaned object) @en
preferred label: lån (föremål) @sv
source: Kielitoimiston sanakirja
broader: taloudelliset ilmiöt
comment: jnk esineen tms. luovuttaminen (korvauksetta) toiselle jksik aikaa; näin syntyvä olotila; näin luovutettu esine
alternative label: lainat
in scheme: conceptscheme