ympäristöaktivismi
preferred label: environmental activism @en
preferred label: miljöaktivism @sv
type: Concept
broader: aktivismi

keskinäinen toiminta
preferred label: ömsesidig aktivitet @sv
preferred label: mutual activity @en
type: Concept
narrower: aktivismi

aktivismi
alternative label: kansalaisosallistuminen
alternative label: kansalaisaktivismi
alternative label: kansalaisten osallistuminen
preferred label: aktivism @sv
preferred label: activism @en
type: Concept
narrower: ympäristöaktivismi
scope note: Militant politisk rörelse som verkar för aktivt ingripande i krig eller aktivt motstånd mot t.ex. en ockupationsmakt. @sv
in scheme: conceptscheme
broader: keskinäinen toiminta