flodområden
preferred label: watersystems @en
preferred label: vesistöalueet @fi
type: Concept
related: vattenvårdsområden

vattenvårdsområden
scope note: Ett vattenvårdsområde består av ett eller flera avrinningsområden. En kustvattensträcka och en grundvattenförekomst hänförs till det angränsande vattenvårdsområde som är lämpligast. Av avrinningsområden som sträcker sig in på en annan stats territorium kan ett internationellt vattenvårdsområde bildas. (Lag)
preferred label: vesienhoitoalueet @fi
preferred label: river basin districts @en
broader: områden definierade genom människans aktivitet
related: flodområden
in scheme: conceptscheme
type: Concept

områden definierade genom människans aktivitet
preferred label: areas defined by human @en
preferred label: ihmisen määrittämät alueet @fi
type: Concept
narrower: vattenvårdsområden