hatbrott
broader: brott (juridik)
scope note: Hatbrott är inte i sig en brottsrubricering utan en samlande beteckning på brott där det i motivet funnits ett tydligt hat mot det som offret i gärningsmannens ögon representerade.
in scheme: conceptscheme
preferred label: hate crimes @en
preferred label: viharikokset @fi
type: Concept

brott (juridik)
preferred label: crimes @en
preferred label: rikokset @fi
type: Concept
narrower: hatbrott