simpukat
preferred label: bivalvia @en
preferred label: musslor @sv
type: Concept
narrower: idänsydänsimpukka

idänsydänsimpukka
broader: simpukat
scope note: Kan eventuellt även åsyfta arten C. lamarcki.
in scheme: conceptscheme
preferred label: olive green cockle @en
preferred label: skev hjärtmussla @sv
type: Concept