nykysirkus
preferred label: nycirkus @sv
preferred label: contemporary circus @en
alternative label: uusi sirkus
alternative label: kokeellinen sirkus
related: tulitaide
scope note: Nycirkus är en etablerad konstform som har vuxit fram ur ungdomskulturen på gator och torg. Den skiljer sig ifrån traditionell cirkus genom att den i föreställningarna blandar rockmusik, poesi, dans, akrobatik och nya sportredskap som rollerblades och mountainbikes. @sv
broader: sirkus (taidelajit)
in scheme: conceptscheme
type: Concept

tulitaide
preferred label: fire dancing @en
preferred label: eldkonst @sv
type: Concept
related: nykysirkus

sirkus (taidelajit)
preferred label: cirkus (konstart) @sv
preferred label: circus @en
type: Concept
narrower: nykysirkus