Villa Petrell
broader: buildings
comment: Norjalaisen arkkitehdin A. Arnebergin suunnittelema tiilinen huvilarakennus vuodelta 1916 Luvialla
in scheme: conceptscheme
type: Concept

buildings
preferred label: rakennukset @fi
preferred label: byggnader @sv
type: Concept
narrower: Villa Petrell