nationalparker
preferred label: national parks @en
preferred label: kansallispuistot @fi
type: Concept
narrower: Kalevala nationalpark

Kalevala nationalpark
broader: nationalparker
scope note: Nationalpark i Karelska republiken i Ryssland
in scheme: conceptscheme
preferred label: Kalevala National Park @en
preferred label: Kalevalan kansallispuisto @fi
type: Concept