naturskyddsområden
preferred label: nature reserves @en
preferred label: luonnonsuojelualueet @fi
type: Concept
narrower: Grotensforsens naturskyddsområde

Grotensforsens naturskyddsområde
broader: naturskyddsområden
scope note: Naturskyddsområde på gränsen mella Helsingfors och Vanda
in scheme: conceptscheme
preferred label: Ruutinkosken luonnonsuojelualue @fi
type: Concept