skal (hölje)
preferred label: shell (concrete inanimate object) @en
preferred label: kuori (konkreettinen eloton objekti) @fi
comment: ohuehko suojaava (t. koossa pitävä) päällys
broader: konkret icke-levande objekt
source: Kielitoimiston sanakirja
alternative label: skal
alternative label: bark
alternative label: kuori @fi
type: Concept
in scheme: conceptscheme

konkret icke-levande objekt
preferred label: concrete inanimate object @en
preferred label: konkreettinen eloton objekti @fi
type: Concept
narrower: skal (hölje)