ellipsit (kielelliset ilmiöt)
in scheme: conceptscheme
preferred label: ellipser (språkliga fenomen) @sv
preferred label: ellipses @en
broader: kielelliset ilmiöt
comment: sanan t. sanojen pois jääminen ilmauksesta merkityksen silti muuttumatta
type: Concept
source: Kielitoimiston sanakirja
alternative label: ellipsit

kielelliset ilmiöt
preferred label: språkliga fenomen @sv
preferred label: linguistic phenomena @en
type: Concept
narrower: ellipsit (kielelliset ilmiöt)