tutkimustoiminta
preferred label: forskningsverksamhet @sv
preferred label: research activity @en
type: Concept
narrower: enologia

enologia
preferred label: oenologi @sv
preferred label: oenology @en
broader: tutkimustoiminta
scope note: Oenologi (œnologi, även enologi och önologi), är läran om vin och dess tillverkning @sv
in scheme: conceptscheme
type: Concept
alternative label: viinioppi
alternative label: viinitutkimus